{"text_format":"1","workbook":"xlsx","n_sheets":8,"sheets":["Ativos","Passivos","Demais","Excedentes","Calculo CRmerc","Racional de Calculo","Tabelas","Versões"],"not_rendered":{"charts":0,"images":0,"macros":1,"external_links":0,"defined_names":21,"comments":2,"pivot_tables":0},"unopened":[],"bounds":{"document_bytes":16777216,"sheet_cells":100000,"rows_first":2000,"rows_last":500,"rows_between":2000,"halvings":0,"cell_chars":16384,"cell_head_chars":4096},"cells_cut":0,"cells_raw":0,"read":"whole","date_system":"1900"}

{"sheet":"Ativos","index":0,"n_rows":5,"n_cols":32,"rows_kept":5,"cut":false,"hidden":false,"merged":[]}
["Capital de Risco Baseado no Risco de Mercado"]
["Fluxos de caixa dos Ativos Financeiros"]
[]
["EMFSEQ","ENTCODIGO","MRFMESANO","QUAID","ATVCODIGO","TPFOPERADOR","FTRCODIGO","LCRCODIGO","TCTCODIGO","TPECODIGO","EMFPRAZOFLUXO","EMFVLREXPRISCO","EMFCNPJFUNDO","EMFCODISIN","EMFCODCUSTODIA","EMFMULTIPLOFATOR","EMFTXCONTRATADO","EMFTXMERCADO","TPFOPERADORDERIVATIVO","EMFVLRDERIVATIVO","EMFCODGRUPO",null,"VALOR","VALOR - AJUSTE DAS EXP. PRE EM TITULOS %DI","FATOR - AJUSTE DAS EXP. PRE EM TITULOS %DI","PRAZO ANUAL","GRUPAMENTO","VERTTICE ANTERIOR","VERTICE POSTERIOR","ALOCACAO ANTERIOR","ALOCACAO POSTERIOR","TOTALIZAÇÃO ATIVOS"]
[null,null,null,null,null,null,null,null,null,null,null,null,null,null,null,null,null,null,null,null,null,null,{"$f":"IF(AND(ISBLANK(grupo),ISERROR(VLOOKUP(U5,codgrupo_excedentes,1,0))),L5*IF(F5=\"+\",1,-1),IF(AND(NOT(ISBLANK(grupo)),U5=grupo),L5*IF(F5=\"+\",1,-1),0))","v":0},{"$f":"IF(AND(OR(G5=\"TD1\",G5=\"TS1\"),Q5<>R5),(R5-Q5)/100*W5,W5)","v":0},{"$f":"IF(AND(OR(G5=\"TD1\",G5=\"TS1\"),Q5<>R5),\"JJ1\",G5)","v":0},{"$f":"K5/252","v":0},{"$f":"VLOOKUP(Y5,rel_indices,3,0)","v":{"$error":"#N/A"}},{"$f":"IFERROR(VLOOKUP(Z5,IF(VLOOKUP(Y5,rel_juros,2,0)=\"INDICES\",vert_indices,IF(VLOOKUP(Y5,rel_juros,2,0)=\"PRE\",vert_pre,vert_cambial)),1,1),\"\")","v":""},{"$f":"IFERROR(VLOOKUP(AB5,IF(VLOOKUP(Y5,rel_juros,2,0)=\"INDICES\",vert_indices,IF(VLOOKUP(Y5,rel_juros,2,0)=\"PRE\",vert_pre,vert_cambial)),2,0),\"\")","v":""},{"$f":"IFERROR(X5*(AC5-Z5)/(AC5-AB5),\"\")","v":""},{"$f":"IFERROR(IF(AC5=0,0,X5*(Z5-AB5)/(AC5-AB5)),\"\")","v":""},{"$f":"IF(P5=0,IF(ISERROR(VLOOKUP(E5,calc_total_ativos,1,0)),L5*IF(F5=\"+\",1,-1),T5*IF(S5=\"+\",1,-1)),0)","v":0}]

{"sheet":"Passivos","index":1,"n_rows":5,"n_cols":20,"rows_kept":5,"cut":false,"hidden":false,"merged":[[1,0,1,3]]}
["Capital de Risco Baseado no Risco de Mercado"]
["Fluxos de caixa de Direitos e Obrigações Relacionados a Contratos de Seguros"]
[]
["EMCSEQ","ENTCODIGO","MRFMESANO","QUAID","DOCCODIGO","TPFOPERADOR","FTRCODIGO","EMCPRAZOFLUXO","EMCVLREXPRISCO","EMCMULTIPLOFATOR","EMCCODGRUPO","EMCSEMREGISTRO",null,"VALOR","Prazo Anual","GRUPAMENTO","VERTTICE ANTERIOR","VERTICE POSTERIOR","ALOCACAO ANTERIOR","ALOCACAO POSTERIOR"]
[null,null,null,null,null,null,null,null,null,null,null,null,"x",{"$f":"IF(AND(ISBLANK(grupo),ISERROR(VLOOKUP(K5,codgrupo_excedentes,1,0))),I5*IF(F5=\"+\",1,-1),IF(AND(NOT(ISBLANK(grupo)),K5=grupo),I5*IF(F5=\"+\",1,-1),0))","v":0},{"$f":"H5/252","v":0},{"$f":"VLOOKUP(G5,rel_indices,3,0)","v":{"$error":"#N/A"}},{"$f":"IFERROR(VLOOKUP(O5,IF(VLOOKUP(G5,rel_juros,2,0)=\"INDICES\",vert_indices,IF(VLOOKUP(G5,rel_juros,2,0)=\"PRE\",vert_pre,vert_cambial)),1,1),\"\")","v":""},{"$f":"IFERROR(VLOOKUP(Q5,IF(VLOOKUP(G5,rel_juros,2,0)=\"INDICES\",vert_indices,IF(VLOOKUP(G5,rel_juros,2,0)=\"PRE\",vert_pre,vert_cambial)),2,0),\"\")","v":""},{"$f":"IFERROR(N5*(R5-O5)/(R5-Q5),\"\")","v":""},{"$f":"IFERROR(IF(R5=0,0,N5*(O5-Q5)/(R5-Q5)),\"\")","v":""}]

{"sheet":"Demais","index":2,"n_rows":5,"n_cols":18,"rows_kept":5,"cut":false,"hidden":false,"merged":[]}
["Capital de Risco Baseado no Risco de Mercado"]
["Fluxos de caixa dos Demais Ativos e Passivos "]
[]
["EMDSEQ","ENTCODIGO","MRFMESANO","QUAID","DODCODIGO","TPFOPERADOR","FTRCODIGO","EMDPRAZOFLUXO","EMDVLREXPRISCO","EMDMULTIPLOFATOR",null,"VALOR","Prazo Anual","GRUPAMENTO","VERTTICE ANTERIOR","VERTICE POSTERIOR","ALOCACAO ANTERIOR","ALOCACAO POSTERIOR"]
[null,null,null,null,null,null,null,null,null,null,null,{"$f":"IF(ISBLANK(grupo),I5*IF(F5=\"+\",1,-1),\"\")","v":0},{"$f":"H5/252","v":0},{"$f":"VLOOKUP(G5,rel_indices,3,0)","v":{"$error":"#N/A"}},{"$f":"IFERROR(VLOOKUP(M5,IF(VLOOKUP(G5,rel_juros,2,0)=\"INDICES\",vert_indices,IF(VLOOKUP(G5,rel_juros,2,0)=\"PRE\",vert_pre,vert_cambial)),1,1),\"\")","v":""},{"$f":"IFERROR(VLOOKUP(O5,IF(VLOOKUP(G5,rel_juros,2,0)=\"INDICES\",vert_indices,IF(VLOOKUP(G5,rel_juros,2,0)=\"PRE\",vert_pre,vert_cambial)),2,0),\"\")","v":""},{"$f":"IFERROR(L5*(P5-M5)/(P5-O5),\"\")","v":""},{"$f":"IFERROR(IF(P5=0,0,L5*(M5-O5)/(P5-O5)),\"\")","v":""}]

{"sheet":"Excedentes","index":3,"n_rows":4,"n_cols":11,"rows_kept":4,"cut":false,"hidden":false,"merged":[[1,0,1,3]]}
["Capital de Risco Baseado no Risco de Mercado"]
["Detalhamento dos Grupos de Excedentes Financeiros para fins de cálculo de acordo com o §3º do artigo 50 da Resolução CNSP nº 321/2015"]
[]
["EMESEQ","ENTCODIGO","MRFMESANO","QUAID","EMECODGRUPO","EMEPEF","EMEVLRCONTATIVOS","EMEPERCREVERSAO","EMEPERCDEDUCAO",null,"CRmerc.exc i"]

{"sheet":"Calculo CRmerc","index":4,"n_rows":43,"n_cols":14,"rows_kept":43,"cut":false,"hidden":false,"merged":[[0,5,0,6],[36,10,36,13],[5,0,6,0],[5,1,5,4],[5,5,5,8],[5,9,5,12],[28,1,28,4],[28,5,28,8],[28,10,28,13],[1,9,1,10],[2,9,2,10],[3,9,3,10],[0,9,0,11],[32,10,32,13]]}
["Capital de Risco Baseado no Risco de Mercado",null,null,null,null,"Cálculo do CRmerc",null,null,null,"TRATAMENTO DOS EXCEDENTES"]
["Cálculo do CRmerc (Resolução CNSP nº 321/2015)",null,null,null,null,"CRmerc.geral",{"$f":"IF(ISBLANK(grupo),SQRT(MMULT(MMULT(vet_exposicoes,matriz_fatores),TRANSPOSE(vet_exposicoes))),\"\")","v":0},null,null,"Grupo de Produtos com Excedentes"]
[null,null,null,null,null,"Σ CRmerc.exci",{"$f":"SUM(Excedentes!$K:$K)","v":0},null,null,"CRmerc.geral i (R$)",null,{"$f":"IF(AND(NOT(ISBLANK(grupo)),NOT(ISERROR(VLOOKUP(grupo,codgrupo_excedentes,1,0)))),SQRT(MMULT(MMULT(vet_exposicoes,matriz_fatores),TRANSPOSE(vet_exposicoes))),\"\")","v":""}]
["CRmerc","=        E' x   F   x   E",null,null,null,"CRmerc (R$)",{"$f":"IF(ISBLANK(grupo),'Racional de Calculo'!D4+SUM(Excedentes!$K:$K),\"\")","v":0},null,null,"CRmerc.exc i (R$)",null,{"$f":"IF(AND(NOT(ISBLANK(grupo)),NOT(ISERROR(VLOOKUP(grupo,codgrupo_excedentes,1,0)))),L3-MIN(L3*VLOOKUP(grupo,excedentes,4,0)/100,MAX(0,(VLOOKUP(grupo,excedentes,2,0)+\n(SUMIF(Ativos!$U:$U,grupo,Ativos!$AF:$AF)-VLOOKUP(grupo,excedentes,3,0))*(1-VLOOKUP(grupo,excedentes,5,0)/100/2)))),\"\")","v":""}]
[]
[null,"TR",null,null,null,"IGPM",null,null,null,"IPCA"]
[null,"At. Fin","Pass. Tec","Demais","Exp. Liq.","At. Fin","Pass. Tec","Demais","Exp. Liq.","At. Fin","Pass. Tec","Demais","Exp. Liq."]
["Indexado",{"$f":"SUMIF(Ativos!$AA:$AA,\"TR\",Ativos!$X:$X)","v":0},{"$f":"SUMIF(Passivos!$P:$P,\"TR\",Passivos!$N:$N)","v":0},{"$f":"SUMIF(Demais!$N:$N,\"TR\",Demais!$L:$L)","v":0},{"$f":"B8+C8+D8","v":0},{"$f":"SUMIF(Ativos!$AA:$AA,\"IGPM\",Ativos!$X:$X)","v":0},{"$f":"SUMIF(Passivos!$P:$P,\"IGPM\",Passivos!$N:$N)","v":0},{"$f":"SUMIF(Demais!$N:$N,\"IGPM\",Demais!$L:$L)","v":0},{"$f":"F8+G8+H8","v":0},{"$f":"SUMIF(Ativos!$AA:$AA,\"IPCA\",Ativos!$X:$X)","v":0},{"$f":"SUMIF(Passivos!$P:$P,\"IPCA\",Passivos!$N:$N)","v":0},{"$f":"SUMIF(Demais!$N:$N,\"IPCA\",Demais!$L:$L)","v":0},{"$f":"J8+K8+L8","v":0}]
[0.25,{"$f":"SUMIFS(Ativos!$AD:$AD,Ativos!$AA:$AA,\"TR\",Ativos!$AB:$AB,$A9)+SUMIFS(Ativos!$AE:$AE,Ativos!$AA:$AA,\"TR\",Ativos!$AC:$AC,$A9)","v":0},{"$f":"SUMIFS(Passivos!$S:$S,Passivos!$P:$P,\"TR\",Passivos!$Q:$Q,$A9)+SUMIFS(Passivos!$T:$T,Passivos!$P:$P,\"TR\",Passivos!$R:$R,$A9)","v":0},{"$f":"SUMIFS(Demais!$Q:$Q,Demais!$N:$N,\"TR\",Demais!$O:$O,$A9)+SUMIFS(Demais!$R:$R,Demais!$N:$N,\"TR\",Demais!$P:$P,$A9)","v":0},{"$f":"B9+C9+D9","v":0},{"$f":"SUMIFS(Ativos!$AD:$AD,Ativos!$AA:$AA,\"IGPM\",Ativos!$AB:$AB,$A9)+SUMIFS(Ativos!$AE:$AE,Ativos!$AA:$AA,\"IGPM\",Ativos!$AC:$AC,$A9)","v":0},{"$f":"SUMIFS(Passivos!$S:$S,Passivos!$P:$P,\"IGPM\",Passivos!$Q:$Q,$A9)+SUMIFS(Passivos!$T:$T,Passivos!$P:$P,\"IGPM\",Passivos!$R:$R,$A9)","v":0},{"$f":"SUMIFS(Demais!$Q:$Q,Demais!$N:$N,\"IGPM\",Demais!$O:$O,$A9)+SUMIFS(Demais!$R:$R,Demais!$N:$N,\"IGPM\",Demais!$P:$P,$A9)","v":0},{"$f":"F9+G9+H9","v":0},{"$f":"SUMIFS(Ativos!$AD:$AD,Ativos!$AA:$AA,\"IPCA\",Ativos!$AB:$AB,$A9)+SUMIFS(Ativos!$AE:$AE,Ativos!$AA:$AA,\"IPCA\",Ativos!$AC:$AC,$A9)","v":0},{"$f":"SUMIFS(Passivos!$S:$S,Passivos!$P:$P,\"IPCA\",Passivos!$Q:$Q,$A9)+SUMIFS(Passivos!$T:$T,Passivos!$P:$P,\"IPCA\",Passivos!$R:$R,$A9)","v":0},{"$f":"SUMIFS(Demais!$Q:$Q,Demais!$N:$N,\"IPCA\",Demais!$O:$O,$A9)+SUMIFS(Demais!$R:$R,Demais!$N:$N,\"IPCA\",Demais!$P:$P,$A9)","v":0},{"$f":"J9+K9+L9","v":0}]
[0.5,{"$f":"SUMIFS(Ativos!$AD:$AD,Ativos!$AA:$AA,\"TR\",Ativos!$AB:$AB,$A10)+SUMIFS(Ativos!$AE:$AE,Ativos!$AA:$AA,\"TR\",Ativos!$AC:$AC,$A10)","v":0},{"$f":"SUMIFS(Passivos!$S:$S,Passivos!$P:$P,\"TR\",Passivos!$Q:$Q,$A10)+SUMIFS(Passivos!$T:$T,Passivos!$P:$P,\"TR\",Passivos!$R:$R,$A10)","v":0},{"$f":"SUMIFS(Demais!$Q:$Q,Demais!$N:$N,\"TR\",Demais!$O:$O,$A10)+SUMIFS(Demais!$R:$R,Demais!$N:$N,\"TR\",Demais!$P:$P,$A10)","v":0},{"$f":"B10+C10+D10","v":0},{"$f":"SUMIFS(Ativos!$AD:$AD,Ativos!$AA:$AA,\"IGPM\",Ativos!$AB:$AB,$A10)+SUMIFS(Ativos!$AE:$AE,Ativos!$AA:$AA,\"IGPM\",Ativos!$AC:$AC,$A10)","v":0},{"$f":"SUMIFS(Passivos!$S:$S,Passivos!$P:$P,\"IGPM\",Passivos!$Q:$Q,$A10)+SUMIFS(Passivos!$T:$T,Passivos!$P:$P,\"IGPM\",Passivos!$R:$R,$A10)","v":0},{"$f":"SUMIFS(Demais!$Q:$Q,Demais!$N:$N,\"IGPM\",Demais!$O:$O,$A10)+SUMIFS(Demais!$R:$R,Demais!$N:$N,\"IGPM\",Demais!$P:$P,$A10)","v":0},{"$f":"F10+G10+H10","v":0},{"$f":"SUMIFS(Ativos!$AD:$AD,Ativos!$AA:$AA,\"IPCA\",Ativos!$AB:$AB,$A10)+SUMIFS(Ativos!$AE:$AE,Ativos!$AA:$AA,\"IPCA\",Ativos!$AC:$AC,$A10)","v":0},{"$f":"SUMIFS(Passivos!$S:$S,Passivos!$P:$P,\"IPCA\",Passivos!$Q:$Q,$A10)+SUMIFS(Passivos!$T:$T,Passivos!$P:$P,\"IPCA\",Passivos!$R:$R,$A10)","v":0},{"$f":"SUMIFS(Demais!$Q:$Q,Demais!$N:$N,\"IPCA\",Demais!$O:$O,$A10)+SUMIFS(Demais!$R:$R,Demais!$N:$N,\"IPCA\",Demais!$P:$P,$A10)","v":0},{"$f":"J10+K10+L10","v":0}]
{"$rows_left_out":34}
{"sheet":"Racional de Calculo","index":5,"n_rows":280,"n_cols":84,"rows_kept":280,"cut":false,"hidden":true,"merged":[[3,1,3,2],[4,5,4,7],[5,5,5,7],[6,5,6,7],[3,5,3,8],[5,1,5,2],[9,78,10,78],[9,79,10,79],[9,80,10,80],[9,81,10,81],[9,82,10,82],[9,77,10,77],[9,0,9,11],[9,12,9,29],[9,30,9,47],[9,48,9,65],[9,66,9,76]]}
["Capital de Risco Baseado no Risco de Mercado"]
["Fórmula Padrão SUSEP (Resolução CNSP nº 317/2014)"]
[]
[null,"CRmerc.geral (R$)",null,{"$f":"IF(ISBLANK(grupo),SQRT(MMULT(MMULT(vet_exposicoes,matriz_fatores),TRANSPOSE(vet_exposicoes))),\"\")","v":0},null,"TRATAMENTO DOS EXCEDENTES"]
[null,null,null,null,null,"Grupo de Produtos com Excedentes"]
[null,"CRmerc.exc (R$)",null,{"$f":"SUM(Excedentes!$K:$K)","v":0},null,"CRmerc.geral i (R$)",null,null,{"$f":"IF(AND(NOT(ISBLANK(grupo)),NOT(ISERROR(VLOOKUP(grupo,codgrupo_excedentes,1,0)))),SQRT(MMULT(MMULT(vet_exposicoes,matriz_fatores),TRANSPOSE(vet_exposicoes))),\"\")","v":""}]
[null,null,null,null,null,"CRmerc.exc i (R$)",null,null,{"$f":"IF(AND(NOT(ISBLANK(grupo)),NOT(ISERROR(VLOOKUP(grupo,codgrupo_excedentes,1,0)))),H7-MIN(H7*VLOOKUP(grupo,excedentes,4,0)/100,(VLOOKUP(grupo,excedentes,2,0)+\n(SUMIF(Ativos!$U:$U,grupo,Ativos!$W:$W)-VLOOKUP(grupo,excedentes,3,0))*(1-VLOOKUP(grupo,excedentes,5,0)/100/2))),\"\")","v":""}]
[]
["Vetor de Exposições"]
["Vértices Pre (Anuais)",null,null,null,null,null,null,null,null,null,null,null,"Vértices Cupom de IGPM (Anuais)",null,null,null,null,null,null,null,null,null,null,null,null,null,null,null,null,null,"Vértices Cupom de IPCA (Anuais)",null,null,null,null,null,null,null,null,null,null,null,null,null,null,null,null,null,"VERTICES TR",null,null,null,null,null,null,null,null,null,null,null,null,null,null,null,null,null,"Vértices Cupom Cambial (Anuais)",null,null,null,null,null,null,null,null,null,null,"Valor Indexado a IGPM","Valor Indexado a IPCA","Valor Indexado a TR","Valor Indexado a Ações","Valor Indexado a Câmbio","Valor Indexado a Commodities"]
{"$rows_left_out":271}
{"sheet":"Tabelas","index":6,"n_rows":39,"n_cols":12,"rows_kept":39,"cut":false,"hidden":true,"merged":[[2,4,2,5],[2,6,2,7],[2,8,2,9]]}
["Tabela Auxiliar 1",null,null,null,"Tabela Auxiliar 2",null,null,null,null,null,null,"Tabela Auxiliar para Somatório de Valor de Mercado dos Excedentes"]
[]
["FATOR","GRUPO MACRO","GRUPO MICRO",null,"INDICES",null,"PRE",null,"CAMBIAL",null,null,"ATVCODIGO"]
["JT1","INDICES","TR",null,0,{"$f":"E5","v":0.25},0,{"$f":"G5","v":8.3333333333333329E-2},0,{"$f":"I5","v":8.3333333333333329E-2},null,"D0001"]
["JT9","INDICES","TR",null,0.25,0.5,{"$f":"1/12","v":8.3333333333333329E-2},0.25,{"$f":"1/12","v":8.3333333333333329E-2},0.25,null,"D1001"]
["JI2","INDICES","IGPM",null,0.5,1,0.25,0.5,0.25,0.5,null,"D1002"]
["JI9","INDICES","IGPM",null,1,1.5,0.5,1,0.5,1,null,"D2001"]
["JI1","INDICES","IPCA",null,1.5,2,1,1.5,1,1.5,null,"D2002"]
["JI8","INDICES","IPCA",null,2,2.5,1.5,2,1.5,2,null,"D3001"]
["JJ1","PRE","PRE",null,2.5,3,2,2.5,2,2.5]
{"$rows_left_out":30}
{"sheet":"Versões","index":7,"n_rows":11,"n_cols":2,"rows_kept":11,"cut":false,"hidden":false,"merged":[]}
["Versão","Modificações"]
["1.0","Versão Inicial"]
["1.1","Utilizou-se o DI contratado x praticado pelo mercado para os títulos que remuneram por % do DI.\n\nAlteração do Cálculo dos fatores: Nova data-base para o cálculo dos fatores: Julho de 2014.\n\nAlteração do Cálculo dos fatores: Aumentou-se a precisão do Quantil da Normal (2,326348).\n\nAlteração do Cálculo dos fatores: Cobertura para três meses ao invés de um ano.\n\nAjuste da versão anterior no procedimento de cálculo: Na coluna Y da aba ativos_fin, uma empresa reportou uma possível confusão tendo em vista as orientações dadas nas apresentações o que poderia estar gerando a inversão indevida da ponta vendida prefixada de contratos futuros a depender do entendimento da empresa.\n"]
["2.0","Mudança da estrutura da planilha:\n- Aumento de eficiência da planilha com consequente exclusão de diversas colunas auxiliares de cálculo das abas Ativos, Passivos e Demais.\n- Inclusão do cálculo diferenciado para as empresas que que forneceram dados adicionais para tratamento diferenciados de excedentes financeiros de produtos tradicionais de previdência de acordo com o §3º do artigo 3º da Resolução CNSP nº 321/2015\n\nMudança do Layout da Base de Dados:\n- Exclusão do campo TPREMUNTAXA da base de Ativos\n- Incusão do campo VLRDERIVATIVO da base de Ativos\n- Exclusão dos campos PLNCODIGO e RAMCODIGO da base de Passivos\n- Criação da base de detalhamento de planos com garantia de excedentes financeiros\n\nOutros:\n- Inclusão de novos fatores de riscos"]
["2.1","Mudança da estrutura da planilha:\n- Inclusão do campo TIPOFLUXODERIVATIVO no Quadro 419"]
["2.2","Mudança da estrutura da planilha:\n- Correção de bugs"]
["2.3","Mudança da estrutura da planilha:\n- Mudança da forma de cálculo dos riscos de contratos futuros, antes a inclusão das pontas prefixadas era automatica agora as empresas deverão informar.\n\nMudança do Layout da Base de Dados:\n- Mudança de nomes de campos e tabelas: ATIVOCODIGO, TIPOFLUXO, CARTEIRACODIGO, TIPO EMISSOR, TIPOFLUXODERIVATIVO, CONTRATOSEGUROCODIGO e DEMAISCODIGO\n\nOutros:\n- Inclusão de novos fatores de riscos: DPV, FII, PSR, TS2 e TD2\n- Alteração de fatores de riscos: TXS para TS1 e TXD para TD1"]
[2.4,"Mudança do Layout da Base de Dados:\n- Mudança diversas de nomes de campos e tabelas (sem alteração nas estruturas de dados)"]
[2.5,"Mudança de precisão:\n- Foi alterado a precisão da matriz de fatores para a mesma da norma (7 casas decimais)"]
[2.6,"Mudança da estrutura da planilha:\n- Inclusão da opção de carregamento utilizando as bases de envio para o FipEstatístico.\n\nMudança do Layout da Base de Dados:\n- Inclusão do campo EMCSEMREGISTRO no quadro 420.\n"]
{"$rows_left_out":1}